Reaction Details
TargetCoagulation factor X
LigandBDBM50140355
Substrate/Competitorn/a
Meas. Tech.ChEBML_48792
IC50 40±n/a nM
Citation Jia, ZJWu, YHuang, WZhang, PClizbe, LAGoldman, EASinha, UArfsten, AEEdwards, STAlphonso, MHutchaleelaha, AScarborough, RMZhu, BY 1-(2-Naphthyl)-1H-pyrazole-5-carboxylamides as potent factor Xa inhibitors. Part 2: A survey of P4 motifs. Bioorg Med Chem Lett14:1221-7 (2004) 
 
Coagulation factor X
Name:Coagulation factor X
Type:Enzyme
Mol. Mass.:54726.60
Organism:Homo sapiens (Human)
Description:n/a
Residue:488
BDBM50140355
NameBDBM50140355
Synonyms:2-(6-Chloro-naphthalen-2-yl)-5-methyl-2H-pyrazole-3-carboxylic acid (2-fluoro-4-pyridin-4-yl-phenyl)-amide | CHEMBL280725
TypeSmall organic molecule
Emp. Form.C26H18ClFN4O
Mol. Mass.456.899
SMILESCc1cc(C(=O)Nc2ccc(cc2F)-c2ccncc2)n(n1)-c1ccc2cc(Cl)ccc2c1