Reaction Details
TargetSerine protease 1
LigandBDBM50140380
Substrate/Competitorn/a
Meas. Tech.ChEBML_213051
IC50>10000±n/a nM
Citation Jia, ZJWu, YHuang, WZhang, PClizbe, LAGoldman, EASinha, UArfsten, AEEdwards, STAlphonso, MHutchaleelaha, AScarborough, RMZhu, BY 1-(2-Naphthyl)-1H-pyrazole-5-carboxylamides as potent factor Xa inhibitors. Part 2: A survey of P4 motifs. Bioorg Med Chem Lett14:1221-7 (2004) 
 
Serine protease 1
Name:Serine protease 1
Type:Enzyme
Mol. Mass.:26557.80
Organism:Homo sapiens (Human)
Description:P07477
Residue:247
BDBM50140380
NameBDBM50140380
Synonyms:2-(3-Fluoro-naphthalen-2-yl)-5-methyl-2H-pyrazole-3-carboxylic acid (2'-aminomethyl-3-fluoro-biphenyl-4-yl)-amide | CHEMBL20934
TypeSmall organic molecule
Emp. Form.C28H22F2N4O
Mol. Mass.468.4973
SMILESCc1cc(C(=O)Nc2ccc(cc2F)-c2ccccc2CN)n(n1)-c1cc2ccccc2cc1F