Reaction Details
TargetCoagulation factor X
LigandBDBM50140393
Substrate/Competitorn/a
Meas. Tech.ChEBML_48792
IC50 36±n/a nM
Citation Jia, ZJWu, YHuang, WZhang, PClizbe, LAGoldman, EASinha, UArfsten, AEEdwards, STAlphonso, MHutchaleelaha, AScarborough, RMZhu, BY 1-(2-Naphthyl)-1H-pyrazole-5-carboxylamides as potent factor Xa inhibitors. Part 2: A survey of P4 motifs. Bioorg Med Chem Lett14:1221-7 (2004) 
 
Coagulation factor X
Name:Coagulation factor X
Type:Enzyme
Mol. Mass.:54726.60
Organism:Homo sapiens (Human)
Description:n/a
Residue:488
BDBM50140393
NameBDBM50140393
Synonyms:2-(6-Chloro-naphthalen-2-yl)-5-methyl-2H-pyrazole-3-carboxylic acid (4-[1,4]diazepan-1-yl-phenyl)-amide | CHEMBL277028
TypeSmall organic molecule
Emp. Form.C26H26ClN5O
Mol. Mass.459.971
SMILESCc1cc(C(=O)Nc2ccc(cc2)N2CCCNCC2)n(n1)-c1ccc2cc(Cl)ccc2c1