Reaction Details
TargetCoagulation factor X
LigandBDBM50140397
Substrate/Competitorn/a
Meas. Tech.ChEMBL_48792 (CHEMBL662445)
Ki 2.8±n/a nM
Citation Jia, ZJWu, YHuang, WZhang, PClizbe, LAGoldman, EASinha, UArfsten, AEEdwards, STAlphonso, MHutchaleelaha, AScarborough, RMZhu, BY 1-(2-Naphthyl)-1H-pyrazole-5-carboxylamides as potent factor Xa inhibitors. Part 2: A survey of P4 motifs. Bioorg Med Chem Lett14:1221-7 (2004) 
 
Coagulation factor X
Name:Coagulation factor X
Type:Enzyme
Mol. Mass.:54726.60
Organism:Homo sapiens (Human)
Description:n/a
Residue:488
BDBM50140397
NameBDBM50140397
Synonyms:2-(6-Chloro-naphthalen-2-yl)-5-methyl-2H-pyrazole-3-carboxylic acid [4-(2-dimethylaminomethyl-imidazol-1-yl)-phenyl]-amide | CHEMBL280947
TypeSmall organic molecule
Emp. Form.C27H25ClN6O
Mol. Mass.484.98
SMILESCN(C)Cc1nccn1-c1ccc(NC(=O)c2cc(C)nn2-c2ccc3cc(Cl)ccc3c2)cc1