Reaction Details
TargetCoagulation factor X
LigandBDBM50140400
Substrate/Competitorn/a
Meas. Tech.ChEBML_48792
IC50 15±n/a nM
Citation Jia, ZJWu, YHuang, WZhang, PClizbe, LAGoldman, EASinha, UArfsten, AEEdwards, STAlphonso, MHutchaleelaha, AScarborough, RMZhu, BY 1-(2-Naphthyl)-1H-pyrazole-5-carboxylamides as potent factor Xa inhibitors. Part 2: A survey of P4 motifs. Bioorg Med Chem Lett14:1221-7 (2004) 
 
Coagulation factor X
Name:Coagulation factor X
Type:Enzyme
Mol. Mass.:54726.60
Organism:Homo sapiens (Human)
Description:n/a
Residue:488
BDBM50140400
NameBDBM50140400
Synonyms:2-(6-Chloro-naphthalen-2-yl)-5-methyl-2H-pyrazole-3-carboxylic acid [2-fluoro-4-(2-methyl-imidazol-1-yl)-phenyl]-amide | CHEMBL282459
TypeSmall organic molecule
Emp. Form.C25H19ClFN5O
Mol. Mass.459.903
SMILESCc1cc(C(=O)Nc2ccc(cc2F)-n2ccnc2C)n(n1)-c1ccc2cc(Cl)ccc2c1