Reaction Details
TargetCoagulation factor X
LigandBDBM50140404
Substrate/Competitorn/a
Meas. Tech.ChEBML_48792
IC50 23±n/a nM
Citation Jia, ZJWu, YHuang, WZhang, PClizbe, LAGoldman, EASinha, UArfsten, AEEdwards, STAlphonso, MHutchaleelaha, AScarborough, RMZhu, BY 1-(2-Naphthyl)-1H-pyrazole-5-carboxylamides as potent factor Xa inhibitors. Part 2: A survey of P4 motifs. Bioorg Med Chem Lett14:1221-7 (2004) 
 
Coagulation factor X
Name:Coagulation factor X
Type:Enzyme
Mol. Mass.:54726.60
Organism:Homo sapiens (Human)
Description:n/a
Residue:488
BDBM50140404
NameBDBM50140404
Synonyms:2-(3-Methanesulfonyl-naphthalen-2-yl)-5-methyl-2H-pyrazole-3-carboxylic acid [2-fluoro-4-(5-oxo-[1,4]oxazepan-4-yl)-phenyl]-amide | CHEMBL19990
TypeSmall organic molecule
Emp. Form.C27H25FN4O5S
Mol. Mass.536.575
SMILESCc1cc(C(=O)Nc2ccc(cc2F)N2CCOCCC2=O)n(n1)-c1cc2ccccc2cc1S(C)(=O)=O