Reaction Details
TargetCoagulation factor X
LigandBDBM50140405
Substrate/Competitorn/a
Meas. Tech.ChEBML_48792
IC50 131±n/a nM
Citation Jia, ZJWu, YHuang, WZhang, PClizbe, LAGoldman, EASinha, UArfsten, AEEdwards, STAlphonso, MHutchaleelaha, AScarborough, RMZhu, BY 1-(2-Naphthyl)-1H-pyrazole-5-carboxylamides as potent factor Xa inhibitors. Part 2: A survey of P4 motifs. Bioorg Med Chem Lett14:1221-7 (2004) 
 
Coagulation factor X
Name:Coagulation factor X
Type:Enzyme
Mol. Mass.:54726.60
Organism:Homo sapiens (Human)
Description:n/a
Residue:488
BDBM50140405
NameBDBM50140405
Synonyms:2-(6-Chloro-naphthalen-2-yl)-5-methyl-2H-pyrazole-3-carboxylic acid (4-piperidin-1-yl-phenyl)-amide | CHEMBL20708
TypeSmall organic molecule
Emp. Form.C26H25ClN4O
Mol. Mass.444.956
SMILESCc1cc(C(=O)Nc2ccc(cc2)N2CCCCC2)n(n1)-c1ccc2cc(Cl)ccc2c1