Reaction Details
TargetcGMP-specific 3',5'-cyclic phosphodiesterase
LigandBDBM50140624
Substrate/Competitorn/a
Meas. Tech.ChEBML_155208
IC50 0.900000±n/a nM
Citation Pissarnitski, DAAsberom, TBoyle, CDChackalamannil, SChintala, MClader, JWGreenlee, WJHu, YKurowski, SMyers, JPalamanda, JStamford, AWVemulapalli, SWang, YWang, PWu, PXu, R SAR development of polycyclic guanine derivatives targeted to the discovery of a selective PDE5 inhibitor for treatment of erectile dysfunction. Bioorg Med Chem Lett14:1291-4 (2004) 
 
cGMP-specific 3',5'-cyclic phosphodiesterase
Name:cGMP-specific 3',5'-cyclic phosphodiesterase
Type:Protein
Mol. Mass.:99975.83
Organism:Homo sapiens (Human)
Description:O76074
Residue:875
BDBM50140624
NameBDBM50140624
Synonyms:3-(3-bromo-4-hydroxybenzyl)-5-ethyl-4-oxo-(6aR,9aS)-3,4,5,8-tetrahydrocyclopenta[4,5]imidazo[2,1-b]purine-2-carboxamide | CHEMBL286723
TypeSmall organic molecule
Emp. Form.C20H21BrN6O3
Mol. Mass.473.323
SMILESCCN1C2=N[C@@H]3CCC[C@@H]3N2c2nc(C(N)=O)n(Cc3ccc(O)c(Br)c3)c2C1=O