Reaction Details
TargetMultidrug resistance-associated protein 1
LigandBDBM50140840
Substrate/Competitorn/a
Meas. Tech.ChEMBL_103771 (CHEMBL714751)
IC50 12±n/a nM
Citation Wang, SWan, NCHarrison, JMiller, WChuckowree, ISohal, SHancox, TCBaker, SFolkes, AWilson, FThompson, DCocks, SFarmer, HBoyce, AFreathy, CBroadbridge, JScott, JDepledge, PFaint, RMistry, PCharlton, P Design and synthesis of new templates derived from pyrrolopyrimidine as selective multidrug-resistance-associated protein inhibitors in multidrug resistance. J Med Chem47:1339-50 (2004) 
 
Multidrug resistance-associated protein 1
Name:Multidrug resistance-associated protein 1
Type:n/a
Mol. Mass.:171597.72
Organism:Homo sapiens (Human)
Description:P33527
Residue:1531
BDBM50140840
NameBDBM50140840
Synonyms:(4-{4-[2-(3,4-Difluoro-phenyl)-ethyl]-piperazin-1-yl}-5-methyl-5H-pyrido[3',4':4,5]pyrrolo[3,2-d]pyrimidin-9-yl)-dimethyl-amine | CHEMBL26150
TypeSmall organic molecule
Emp. Form.C24H27F2N7
Mol. Mass.451.5149
SMILESCN(C)c1nccc2n(C)c3c(ncnc3c12)N1CCN(CCc2ccc(F)c(F)c2)CC1