Reaction Details
TargetMultidrug resistance-associated protein 1
LigandBDBM50140844
Substrate/Competitorn/a
Meas. Tech.ChEMBL_103769 (CHEMBL714115)
IC50 1255±n/a nM
Citation Wang, SWan, NCHarrison, JMiller, WChuckowree, ISohal, SHancox, TCBaker, SFolkes, AWilson, FThompson, DCocks, SFarmer, HBoyce, AFreathy, CBroadbridge, JScott, JDepledge, PFaint, RMistry, PCharlton, P Design and synthesis of new templates derived from pyrrolopyrimidine as selective multidrug-resistance-associated protein inhibitors in multidrug resistance. J Med Chem47:1339-50 (2004) 
 
Multidrug resistance-associated protein 1
Name:Multidrug resistance-associated protein 1
Type:n/a
Mol. Mass.:171597.72
Organism:Homo sapiens (Human)
Description:P33527
Residue:1531
BDBM50140844
NameBDBM50140844
Synonyms:8-{4-[2-(3,4-Difluoro-phenyl)-ethyl]-piperazin-1-yl}-2,9-dimethyl-9H-1,5,7,9-tetraaza-fluorene-4-carbonitrile | CHEMBL28168
TypeSmall organic molecule
Emp. Form.C24H23F2N7
Mol. Mass.447.4831
SMILESCc1cc(C#N)c2c(n1)n(C)c1c(ncnc21)N1CCN(CCc2ccc(F)c(F)c2)CC1