Reaction Details
TargetATP-dependent translocase ABCB1
LigandBDBM50140862
Substrate/Competitorn/a
Meas. Tech.ChEMBL_148009 (CHEMBL751606)
IC50 1110±n/a nM
Citation Wang, SWan, NCHarrison, JMiller, WChuckowree, ISohal, SHancox, TCBaker, SFolkes, AWilson, FThompson, DCocks, SFarmer, HBoyce, AFreathy, CBroadbridge, JScott, JDepledge, PFaint, RMistry, PCharlton, P Design and synthesis of new templates derived from pyrrolopyrimidine as selective multidrug-resistance-associated protein inhibitors in multidrug resistance. J Med Chem47:1339-50 (2004) 
 
ATP-dependent translocase ABCB1
Name:ATP-dependent translocase ABCB1
Type:Protein
Mol. Mass.:140669.02
Organism:Mus musculus (Mouse)
Description:P21447
Residue:1276
BDBM50140862
NameBDBM50140862
Synonyms:5-Benzyl-4-{4-[2-(3,4-difluoro-phenyl)-ethyl]-piperazin-1-yl}-5H-pyrido[3',4':4,5]pyrrolo[3,2-d]pyrimidine | CHEMBL26081
TypeSmall organic molecule
Emp. Form.C28H26F2N6
Mol. Mass.484.543
SMILESFc1ccc(CCN2CCN(CC2)c2ncnc3c4cnccc4n(Cc4ccccc4)c23)cc1F