Reaction Details
TargetATP-dependent translocase ABCB1
LigandBDBM50140839
Substrate/Competitorn/a
Meas. Tech.ChEMBL_148007 (CHEMBL754165)
IC50 6140±n/a nM
Citation Wang, SWan, NCHarrison, JMiller, WChuckowree, ISohal, SHancox, TCBaker, SFolkes, AWilson, FThompson, DCocks, SFarmer, HBoyce, AFreathy, CBroadbridge, JScott, JDepledge, PFaint, RMistry, PCharlton, P Design and synthesis of new templates derived from pyrrolopyrimidine as selective multidrug-resistance-associated protein inhibitors in multidrug resistance. J Med Chem47:1339-50 (2004) 
 
ATP-dependent translocase ABCB1
Name:ATP-dependent translocase ABCB1
Type:Protein
Mol. Mass.:140669.02
Organism:Mus musculus (Mouse)
Description:P21447
Residue:1276
BDBM50140839
NameBDBM50140839
Synonyms:4-{4-[2-(3,4-Difluoro-phenyl)-ethyl]-piperazin-1-yl}-9-nitro-5-pyridin-4-ylmethyl-5H-pyrimido[5,4-b]indole | CHEMBL29743
TypeSmall organic molecule
Emp. Form.C28H25F2N7O2
Mol. Mass.529.5406
SMILES[O-][N+](=O)c1cccc2n(Cc3ccncc3)c3c(ncnc3c12)N1CCN(CCc2ccc(F)c(F)c2)CC1