Reaction Details
TargetATP-dependent translocase ABCB1
LigandBDBM50140867
Substrate/Competitorn/a
Meas. Tech.ChEMBL_148009 (CHEMBL751606)
IC50 2000±n/a nM
Citation Wang, SWan, NCHarrison, JMiller, WChuckowree, ISohal, SHancox, TCBaker, SFolkes, AWilson, FThompson, DCocks, SFarmer, HBoyce, AFreathy, CBroadbridge, JScott, JDepledge, PFaint, RMistry, PCharlton, P Design and synthesis of new templates derived from pyrrolopyrimidine as selective multidrug-resistance-associated protein inhibitors in multidrug resistance. J Med Chem47:1339-50 (2004) 
 
ATP-dependent translocase ABCB1
Name:ATP-dependent translocase ABCB1
Type:Protein
Mol. Mass.:140669.02
Organism:Mus musculus (Mouse)
Description:P21447
Residue:1276
BDBM50140867
NameBDBM50140867
Synonyms:9-Chloro-4-{4-[2-(3,4-difluoro-phenyl)-ethyl]-piperazin-1-yl}-2-methoxymethyl-5-methyl-5H-pyrido[3',4':4,5]pyrrolo[3,2-d]pyrimidine | CHEMBL25905
TypeSmall organic molecule
Emp. Form.C24H25ClF2N6O
Mol. Mass.486.945
SMILESCOCc1nc(N2CCN(CCc3ccc(F)c(F)c3)CC2)c2n(C)c3ccnc(Cl)c3c2n1