Reaction Details
TargetATP-dependent translocase ABCB1
LigandBDBM50140854
Substrate/Competitorn/a
Meas. Tech.ChEMBL_148009 (CHEMBL751606)
IC50 1910±n/a nM
Citation Wang, SWan, NCHarrison, JMiller, WChuckowree, ISohal, SHancox, TCBaker, SFolkes, AWilson, FThompson, DCocks, SFarmer, HBoyce, AFreathy, CBroadbridge, JScott, JDepledge, PFaint, RMistry, PCharlton, P Design and synthesis of new templates derived from pyrrolopyrimidine as selective multidrug-resistance-associated protein inhibitors in multidrug resistance. J Med Chem47:1339-50 (2004) 
 
ATP-dependent translocase ABCB1
Name:ATP-dependent translocase ABCB1
Type:Protein
Mol. Mass.:140669.02
Organism:Mus musculus (Mouse)
Description:P21447
Residue:1276
BDBM50140854
NameBDBM50140854
Synonyms:8-{4-[2-(3,4-Difluoro-phenyl)-ethyl]-piperazin-1-yl}-9-methyl-6-morpholin-4-ylmethyl-9H-1,5,7,9-tetraaza-fluorene-4-carboxylic acid amide | CHEMBL281496
TypeSmall organic molecule
Emp. Form.C28H32F2N8O2
Mol. Mass.550.6029
SMILESCn1c2nccc(C(N)=O)c2c2nc(CN3CCOCC3)nc(N3CCN(CCc4ccc(F)c(F)c4)CC3)c12