Reaction Details
TargetATP-dependent translocase ABCB1
LigandBDBM50140834
Substrate/Competitorn/a
Meas. Tech.ChEMBL_148009 (CHEMBL751606)
IC50 651±n/a nM
Citation Wang, SWan, NCHarrison, JMiller, WChuckowree, ISohal, SHancox, TCBaker, SFolkes, AWilson, FThompson, DCocks, SFarmer, HBoyce, AFreathy, CBroadbridge, JScott, JDepledge, PFaint, RMistry, PCharlton, P Design and synthesis of new templates derived from pyrrolopyrimidine as selective multidrug-resistance-associated protein inhibitors in multidrug resistance. J Med Chem47:1339-50 (2004) 
 
ATP-dependent translocase ABCB1
Name:ATP-dependent translocase ABCB1
Type:Protein
Mol. Mass.:140669.02
Organism:Mus musculus (Mouse)
Description:P21447
Residue:1276
BDBM50140834
NameBDBM50140834
Synonyms:9-Carbamoyl-4-{4-[2-(3,4-difluoro-phenyl)-ethyl]-piperazin-1-yl}-pyrimido[5,4-b]indole-5-carboxylic acid ethyl ester | CHEMBL27536
TypeSmall organic molecule
Emp. Form.C26H26F2N6O3
Mol. Mass.508.5198
SMILESCCOC(=O)n1c2cccc(C(N)=O)c2c2ncnc(N3CCN(CCc4ccc(F)c(F)c4)CC3)c12