Reaction Details
TargetProto-oncogene tyrosine-protein kinase Src
LigandBDBM50097956
Substrate/Competitorn/a
Meas. Tech.ChEMBL_2125053 (CHEMBL4834286)
IC50 120±n/a nM
Citation Mathison, CJNYang, YNelson, JHuang, ZJiang, JChianelli, DRucker, PVRoland, JXie, YFEpple, RBursulaya, BLee, CGao, MYShaffer, JBriones, SSarkisova, YGalkin, ALi, LLi, NLi, CHua, SKasibhatla, SKinyamu-Akunda, JKikkawa, RMolteni, VTellew, JE Antitarget Selectivity and Tolerability of Novel Pyrrolo[2,3- ACS Med Chem Lett12:1912-1919 (2021) 
 
Proto-oncogene tyrosine-protein kinase Src
Name:Proto-oncogene tyrosine-protein kinase Src
Type:Protein
Mol. Mass.:59838.60
Organism:Homo sapiens (Human)
Description:P12931
Residue:536
BDBM50097956
NameBDBM50097956
Synonyms:3-(4-Amino-7-cyclopentyl-7H-pyrrolo[2,3-d]pyrimidin-5-yl)-phenol CHEMBL169390
TypeSmall organic molecule
Emp. Form.C17H18N4O
Mol. Mass.294.351
SMILESNc1ncnc2n(cc(-c3cccc(O)c3)c12)C1CCCC1