Reaction Details
Target5-hydroxytryptamine receptor 2A
LigandBDBM50115021
Substrate/Competitorn/a
Meas. Tech.ChEBML_2453
Ki 167±n/a nM
Citation Varnes, JGGardner, DSSantella, JBDuncia, JVEstrella, MWatson, PSClark, CMKo, SSWelch, PCovington, MStowell, NWadman, EDavies, PSolomon, KNewton, RCTrainor, GLDecicco, CPWacker, DA Discovery of N-propylurea 3-benzylpiperidines as selective CC chemokine receptor-3 (CCR3) antagonists. Bioorg Med Chem Lett14:1645-9 (2004) 
 
5-hydroxytryptamine receptor 2A
Name:5-hydroxytryptamine receptor 2A
Type:undefined
Mol. Mass.:52607.65
Organism:Homo sapiens (Human)
Description:P28223
Residue:471
BDBM50115021
NameBDBM50115021
Synonyms:1-(3-Cyano-phenyl)-3-{3-[4-(4-fluoro-benzyl)-piperidin-1-yl]-propyl}-urea | CHEMBL43677
TypeSmall organic molecule
Emp. Form.C23H27FN4O
Mol. Mass.394.4851
SMILESFc1ccc(CC2CCN(CCCNC(=O)Nc3cccc(c3)C#N)CC2)cc1