Reaction Details
TargetIntegrase
LigandBDBM23399
Substrate/Competitorn/a
Meas. Tech.ChEBML_90868
IC50 2000±n/a nM
Citation Costi, RDi Santo, RArtico, MRoux, ARagno, RMassa, STramontano, ELa Colla, MLoddo, RMarongiu, MEPani, ALa Colla, P 6-aryl-2,4-dioxo-5-hexenoic acids, novel integrase inhibitors active against HIV-1 multiplication in cell-based assays. Bioorg Med Chem Lett14:1745-9 (2004) 
 
Integrase
Name:Integrase
Synonyms:Human immunodeficiency virus type 1 integrase
Type:PROTEIN
Mol. Mass.:32231.48
Organism:Human immunodeficiency virus 1
Description:ChEMBL_90865
Residue:288
BDBM23399
NameBDBM23399
TypeSmall organic molecule
Emp. Form.C15H12FNO4
Mol. Mass.289.2585
SMILESOC(=O)C(=O)CC(=O)c1cccn1Cc1ccc(F)cc1