Reaction Details
TargetD(1A)/D(1B)/D(2)/D(3)/D(4) dopamine receptor
LigandBDBM85933
Substrate/Competitorn/a
Meas. Tech.ChEMBL_60020 (CHEMBL675845)
IC50>1000±n/a nM
Citation Davies, HMHopper, DWHansen, TLiu, QChilders, SR Synthesis of methylphenidate analogues and their binding affinities at dopamine and serotonin transport sites. Bioorg Med Chem Lett14:1799-802 (2004) 
 
D(1A)/D(1B)/D(2)/D(3)/D(4) dopamine receptor
Name:D(1A)/D(1B)/D(2)/D(3)/D(4) dopamine receptor
Synonyms:Dopamine receptor
Type:n/a
Mol. Mass.:n/a
Description:ASSAY_ID of ChEMBL is 60018
Components:This complex has 5 components.
Component 1
Name:D(2) dopamine receptor
Type:G Protein-Coupled Receptor (GPCR)
Mol. Mass.:50931.60
Organism:Rattus norvegicus (rat)
Description:P61169
Residue:444
Component 2
Name:D(1A) dopamine receptor
Synonyms:DOPAMINE D1 Dopamine D1 high Dopamine receptor Dopamine1-like Drd1a
Type:Enzyme Catalytic Domain
Mol. Mass.:49429.75
Organism:RAT
Description:P18901
Residue:446
Component 3
Name:D(3) dopamine receptor
Synonyms:DOPAMINE D3 Dopamine D3 receptor | Drd3
Type:Protein
Mol. Mass.:49540.58
Organism:Rattus norvegicus (Rat)
Description:P19020
Residue:446
Component 4
Name:D(4) dopamine receptor
Synonyms:D(4) dopamine receptor DOPAMINE D4.4 Dopamine receptor | Drd4
Type:Enzyme Catalytic Domain
Mol. Mass.:41307.65
Organism:RAT
Description:DOPAMINE D4.4 0 RAT::P30729
Residue:387
Component 5
Name:D(1B) dopamine receptor
Synonyms:D(1B) dopamine receptor DRD5_RAT Dopamine D5 receptor Drd5
Type:Enzyme Catalytic Domain
Mol. Mass.:52827.88
Organism:RAT
Description:Dopamine D1B 0 RAT::P25115
Residue:475
BDBM85933
NameBDBM85933
Synonyms:TMP | US11001595, Compound TMP
TypeSmall organic molecule
Emp. Form.C14H19NO2
Mol. Mass.233.3062
SMILESCOC(=O)[C@@H]([C@@H]1CCCCN1)c1ccccc1