Reaction Details
TargetMelanocortin receptor 4
LigandBDBM50142897
Substrate/Competitorn/a
Meas. Tech.ChEMBL_106505 (CHEMBL715499)
Ki 220±n/a nM
Citation Vos, TJCaracoti, AChe, JLDai, MFarrer, CAForsyth, NEDrabic, SVHorlick, RALamppu, DYowe, DLBalani, SLi, PZeng, HJoseph, IBRodriguez, LEMaguire, MPPatane, MAClaiborne, CF Identification of 2-[2-[2-(5-bromo-2- methoxyphenyl)-ethyl]-3-fluorophenyl]-4,5-dihydro-1H-imidazole (ML00253764), a small molecule melanocortin 4 receptor antagonist that effectively reduces tumor-induced weight loss in a mouse model. J Med Chem47:1602-4 (2004) 
 
Melanocortin receptor 4
Name:Melanocortin receptor 4
Type:PROTEIN
Mol. Mass.:36964.43
Organism:Mus musculus
Description:ChEMBL_1498850
Residue:332
BDBM50142897
NameBDBM50142897
Synonyms:2-{2-[2-(5-Bromo-2-methoxy-phenyl)-ethyl]-phenyl}-1,4,5,6-tetrahydro-pyrimidine | CHEMBL40233
TypeSmall organic molecule
Emp. Form.C19H21BrN2O
Mol. Mass.373.287
SMILESCOc1ccc(Br)cc1CCc1ccccc1C1=NCCCN1