Reaction Details
TargetN-acetylated-alpha-linked acidic dipeptidase 2
LigandBDBM50398813
Substrate/Competitorn/a
Meas. Tech.ChEMBL_71707 (CHEMBL680921)
Ki 1109±n/a nM
Citation Kozikowski, APZhang, JNan, FPetukhov, PAGrajkowska, EWroblewski, JTYamamoto, TBzdega, TWroblewska, BNeale, JH Synthesis of urea-based inhibitors as active site probes of glutamate carboxypeptidase II: efficacy as analgesic agents. J Med Chem47:1729-38 (2004) 
 
N-acetylated-alpha-linked acidic dipeptidase 2
Name:N-acetylated-alpha-linked acidic dipeptidase 2
Type:PROTEIN
Mol. Mass.:83602.57
Organism:Homo sapiens (Human)
Description:ChEMBL_71707
Residue:740
BDBM50398813
NameBDBM50398813
Synonyms:CHEMBL2114987
TypeSmall organic molecule
Emp. Form.C13H20N2O9
Mol. Mass.348.3059
SMILESC[C@@H](C[C@H](NC(=O)N[C@@H](C[C@H](C)C(O)=O)C(O)=O)C(O)=O)C(O)=O