Reaction Details
TargetFibroblast growth factor receptor 2
LigandBDBM50576988
Substrate/Competitorn/a
Meas. Tech.ChEMBL_2128602 (CHEMBL4838031)
IC50 0.200000±n/a nM
Citation Ran, KZeng, JWan, GHe, XFeng, ZXiang, WWei, WHu, XWang, NLiu, ZYu, L Design, synthesis and biological evaluations of a series of Pyrido[1,2-a]pyrimidinone derivatives as novel selective FGFR inhibitors. Eur J Med Chem220:0 (2021) 
 
Fibroblast growth factor receptor 2
Name:Fibroblast growth factor receptor 2
Type:Enzyme
Mol. Mass.:92015.45
Organism:Homo sapiens (Human)
Description:P21802
Residue:821
BDBM50576988
NameBDBM50576988
Synonyms:CHEMBL4862576
TypeSmall organic molecule
Emp. Form.C25H30N6O3
Mol. Mass.462.5441
SMILESCOc1cc(OC)cc(c1)N(CCNC(C)C)c1ccc2ncc(-c3cnn(C)c3)c(=O)n2c1