Reaction Details
TargetFibroblast growth factor receptor 2
LigandBDBM301310
Substrate/Competitorn/a
Meas. Tech.ChEMBL_2128683 (CHEMBL4838112)
IC50 0.500000±n/a nM
Citation Ran, KZeng, JWan, GHe, XFeng, ZXiang, WWei, WHu, XWang, NLiu, ZYu, L Design, synthesis and biological evaluations of a series of Pyrido[1,2-a]pyrimidinone derivatives as novel selective FGFR inhibitors. Eur J Med Chem220:0 (2021) 
 
Fibroblast growth factor receptor 2
Name:Fibroblast growth factor receptor 2
Type:Enzyme
Mol. Mass.:92015.45
Organism:Homo sapiens (Human)
Description:P21802
Residue:821
BDBM301310
NameBDBM301310
Synonyms:3-(2,6-difluoro-3,5-dimethoxyphenyl)-1-ethyl-8-(morpholin-4-ylmethyl)-1,3,4,7-tetrahydro-2H-pyrrolo[3',2':5,6]pyrido[4,3-d]pyrimidin-2-one US11053246, Example 126 US9611267, Example 126
TypeSmall organic molecule
Emp. Form.C24H27F2N5O4
Mol. Mass.487.4991
SMILESCCN1C(=O)N(Cc2cnc3[nH]c(CN4CCOCC4)cc3c12)c1c(F)c(OC)cc(OC)c1F