Reaction Details
TargetIntegrin alpha-IIb/beta-3
LigandBDBM50143864
Substrate/Competitorn/a
Meas. Tech.ChEMBL_70162 (CHEMBL683382)
IC50 5±n/a nM
Citation Mehrotra, MMHeath, JASmyth, MSPandey, ARose, JWSeroogy, JMVolkots, DLNannizzi-Alaimo, LPark, GLLambing, JLHollenbach, SJScarborough, RM Discovery of novel 2,8-diazaspiro[4.5]decanes as orally active glycoprotein IIb-IIIa antagonists. J Med Chem47:2037-61 (2004) 
 
Integrin alpha-IIb/beta-3
Name:Integrin alpha-IIb/beta-3
Synonyms:Glycoprotein IIb/IIIa
Type:n/a
Mol. Mass.:n/a
Description:ASSAY_ID of EBI is 30109
Components:This complex has 2 components.
Component 1
Name:Integrin beta-3
Type:Protein
Mol. Mass.:87038.91
Organism:Homo sapiens (Human)
Description:P05106
Residue:788
Component 2
Name:Integrin alpha-IIb
Synonyms:CD_antigen=CD41 GPIIb Glycoprotein IIb ITGA2B Integrin alpha-IIb heavy chain Integrin alpha-IIb light chain, form 2 Integrin alpha-V/beta-3 and alpha-IIb/beta 3 | Platelet membrane glycoprotein IIb
Type:Protein
Mol. Mass.:113354.85
Organism:Homo sapiens (Human)
Description:P08514
Residue:1039
BDBM50143864
NameBDBM50143864
Synonyms:5-[2-(4-Carbamimidoyl-phenyl)-1-oxo-2,8-diaza-spiro[4.5]dec-8-yl]-2-(3,5-dimethyl-isoxazole-4-sulfonylamino)-5-oxo-pentanoic acid | CHEMBL418481
TypeSmall organic molecule
Emp. Form.C25H32N6O7S
Mol. Mass.560.623
SMILESCc1noc(C)c1S(=O)(=O)N[C@@H](CCC(=O)N1CCC2(CCN(C2=O)c2ccc(cc2)C(N)=N)CC1)C(O)=O