Reaction Details
TargetAdenylate cyclase type 10
LigandBDBM50577233
Substrate/Competitorn/a
Meas. Tech.ChEMBL_2129836 (CHEMBL4839265)
IC50 225±n/a nM
Citation Fushimi, MBuck, HBalbach, MGorovyy, AFerreira, JRossetti, TKaur, NLevin, LRBuck, JQuast, Jvan den Heuvel, JSteegborn, CFinkin-Groner, EKargman, SMichino, MFoley, MAMiller, MLiverton, NJHuggins, DJMeinke, PT Discovery of TDI-10229: A Potent and Orally Bioavailable Inhibitor of Soluble Adenylyl Cyclase (sAC, ADCY10). ACS Med Chem Lett12:1283-1287 (2021) 
 
Adenylate cyclase type 10
Name:Adenylate cyclase type 10
Type:PROTEIN
Mol. Mass.:187169.28
Organism:Homo sapiens (Human)
Description:ChEMBL_514281
Residue:1610
BDBM50577233
NameBDBM50577233
Synonyms:CHEMBL4874288
TypeSmall organic molecule
Emp. Form.C15H13ClFN5
Mol. Mass.317.749
SMILESCn1cc(Cc2cccc(F)c2)c(n1)-c1cc(Cl)nc(N)n1