Reaction Details
TargetAdenylate cyclase type 10
LigandBDBM50577241
Substrate/Competitorn/a
Meas. Tech.ChEMBL_2129836 (CHEMBL4839265)
IC50 102±n/a nM
Citation Fushimi, MBuck, HBalbach, MGorovyy, AFerreira, JRossetti, TKaur, NLevin, LRBuck, JQuast, Jvan den Heuvel, JSteegborn, CFinkin-Groner, EKargman, SMichino, MFoley, MAMiller, MLiverton, NJHuggins, DJMeinke, PT Discovery of TDI-10229: A Potent and Orally Bioavailable Inhibitor of Soluble Adenylyl Cyclase (sAC, ADCY10). ACS Med Chem Lett12:1283-1287 (2021) 
 
Adenylate cyclase type 10
Name:Adenylate cyclase type 10
Type:PROTEIN
Mol. Mass.:187169.28
Organism:Homo sapiens (Human)
Description:ChEMBL_514281
Residue:1610
BDBM50577241
NameBDBM50577241
Synonyms:CHEMBL4848035
TypeSmall organic molecule
Emp. Form.C14H14ClN5S
Mol. Mass.319.812
SMILESCc1c(Cc2cccs2)c(nn1C)-c1cc(Cl)nc(N)n1