Reaction Details
TargetCarboxypeptidase B2
LigandBDBM50144325
Substrate/Competitorn/a
Meas. Tech.ChEBML_206146
IC50 100±n/a nM
Citation Nantermet, PGBarrow, JCLindsley, SRYoung, MMao, SSCarroll, SBailey, CBosserman, MColussi, DMcMasters, DRVacca, JPSelnick, HG Imidazole acetic acid TAFIa inhibitors: SAR studies centered around the basic P(1)(') group. Bioorg Med Chem Lett14:2141-5 (2004) 
 
Carboxypeptidase B2
Name:Carboxypeptidase B2
Type:Enzyme
Mol. Mass.:48432.74
Organism:Homo sapiens (Human)
Description:Q96IY4
Residue:423
BDBM50144325
NameBDBM50144325
Synonyms:3-((1R,3S)-3-Amino-cyclopentyl)-2-(1-ethyl-1H-imidazol-4-yl)-propionic acid | CHEMBL302817
TypeSmall organic molecule
Emp. Form.C13H21N3O2
Mol. Mass.251.3247
SMILESCCn1cnc(c1)C(C[C@H]1CC[C@H](N)C1)C(O)=O