Reaction Details
TargetCarboxypeptidase B2
LigandBDBM50144316
Substrate/Competitorn/a
Meas. Tech.ChEBML_206146
IC50 100±n/a nM
Citation Nantermet, PGBarrow, JCLindsley, SRYoung, MMao, SSCarroll, SBailey, CBosserman, MColussi, DMcMasters, DRVacca, JPSelnick, HG Imidazole acetic acid TAFIa inhibitors: SAR studies centered around the basic P(1)(') group. Bioorg Med Chem Lett14:2141-5 (2004) 
 
Carboxypeptidase B2
Name:Carboxypeptidase B2
Type:Enzyme
Mol. Mass.:48432.74
Organism:Homo sapiens (Human)
Description:Q96IY4
Residue:423
BDBM50144316
NameBDBM50144316
Synonyms:3-(6-Amino-5-methyl-pyridin-3-yl)-2-(1H-imidazol-4-yl)-propionic acid | CHEMBL303664
TypeSmall organic molecule
Emp. Form.C12H14N4O2
Mol. Mass.246.2652
SMILESCc1cc(CC(C(O)=O)c2cnc[nH]2)cnc1N