Reaction Details
TargetCarboxypeptidase B
LigandBDBM50144336
Substrate/Competitorn/a
Meas. Tech.ChEBML_45638
IC50 1±n/a nM
Citation Nantermet, PGBarrow, JCLindsley, SRYoung, MMao, SSCarroll, SBailey, CBosserman, MColussi, DMcMasters, DRVacca, JPSelnick, HG Imidazole acetic acid TAFIa inhibitors: SAR studies centered around the basic P(1)(') group. Bioorg Med Chem Lett14:2141-5 (2004) 
 
Carboxypeptidase B
Name:Carboxypeptidase B
Type:Enzyme
Mol. Mass.:47367.43
Organism:Homo sapiens (Human)
Description:P15086
Residue:417
BDBM50144336
NameBDBM50144336
Synonyms:3-(6-Amino-5-methyl-pyridin-3-yl)-2-[1-(3-methyl-butyl)-1H-imidazol-4-yl]-propionic acid | CHEMBL66512
TypeSmall organic molecule
Emp. Form.C17H24N4O2
Mol. Mass.316.3981
SMILESCC(C)CCn1cnc(c1)C(Cc1cnc(N)c(C)c1)C(O)=O