Reaction Details
TargetEstrogen receptor
LigandBDBM50144849
Substrate/Competitorn/a
Meas. Tech.ChEMBL_67499 (CHEMBL679890)
IC50 0.8±n/a nM
Citation Kim, SWu, JYBirzin, ETFrisch, KChan, WPai, LYYang, YTMosley, RTFitzgerald, PMSharma, NDahllund, JThorsell, AGDiNinno, FRohrer, SPSchaeffer, JMHammond, ML Estrogen receptor ligands. II. Discovery of benzoxathiins as potent, selective estrogen receptor alpha modulators. J Med Chem47:2171-5 (2004) 
 
Estrogen receptor
Name:Estrogen receptor
Type:Protein
Mol. Mass.:66230.44
Organism:Homo sapiens (Human)
Description:P03372
Residue:595
BDBM50144849
NameBDBM50144849
Synonyms:(2S,3R)-2-(4-(2-(PIPERIDIN-1-YL)ETHOXY)PHENYL)-2,3-DIHYDRO-3-(4-HYDROXYPHENYL)BENZO[B][1,4]OXATHIIN-6-OL CHEMBL304552
TypeSmall organic molecule
Emp. Form.C27H29NO4S
Mol. Mass.463.588
SMILESOc1ccc(cc1)[C@H]1Sc2cc(O)ccc2O[C@H]1c1ccc(OCCN2CCCCC2)cc1