Reaction Details
TargetNeuropeptide Y receptor type 5
LigandBDBM50089060
Substrate/Competitorn/a
Meas. Tech.ChEBML_144155
IC50 3±n/a nM
Citation Rueeger, HGerspacher, MBuehlmayer, PRigollier, PYamaguchi, YSchmidlin, TWhitebread, SNuesslein-Hildesheim, BNick, HCricione, L Discovery and SAR of potent, orally available and brain-penetrable 5,6-dihydro-4H-3-thia-1-aza-benzo[e]azulen- and 4,5-dihydro-6-oxa-3-thia-1-aza-benzo[e]azulen derivatives as neuropeptide Y Y5 receptor antagonists. Bioorg Med Chem Lett14:2451-7 (2004) 
 
Neuropeptide Y receptor type 5
Name:Neuropeptide Y receptor type 5
Type:Enzyme
Mol. Mass.:50746.64
Organism:Homo sapiens (Human)
Description:Q15761
Residue:445
BDBM50089060
NameBDBM50089060
Synonyms:CHEMBL273597 | Naphthalene-1-sulfonic acid [4-(4-amino-quinazolin-2-ylamino)-cyclohexylmethyl]-amide
TypeSmall organic molecule
Emp. Form.C25H27N5O2S
Mol. Mass.461.579
SMILESNc1nc(N[C@H]2CC[C@H](CNS(=O)(=O)c3cccc4ccccc34)CC2)nc2ccccc12