Reaction Details
Target5-hydroxytryptamine receptor 2A
LigandBDBM50145565
Substrate/Competitorn/a
Meas. Tech.ChEMBL_2280 (CHEMBL617066)
Ki 36±n/a nM
Citation Sabb, ALVogel, RLWelmaker, GSSabalski, JECoupet, JDunlop, JRosenzweig-Lipson, SHarrison, B Cycloalkyl[b][1,4]benzodiazepinoindoles are agonists at the human 5-HT2C receptor. Bioorg Med Chem Lett14:2603-7 (2004) 
 
5-hydroxytryptamine receptor 2A
Name:5-hydroxytryptamine receptor 2A
Type:undefined
Mol. Mass.:52607.65
Organism:Homo sapiens (Human)
Description:P28223
Residue:471
BDBM50145565
NameBDBM50145565
Synonyms:1,2,3,4,8,9,10,11,12,13-decahydrocycloocta[b][1,4]diazepino[6,7,1-hi]indole | CHEMBL89738
TypeSmall organic molecule
Emp. Form.C17H22N2
Mol. Mass.254.37
SMILESC1Cn2c3CCCCCCc3c3cccc(CN1)c23