Reaction Details
Target5-hydroxytryptamine receptor 2C
LigandBDBM50145569
Substrate/Competitorn/a
Meas. Tech.ChEBML_2960
Ki 111±n/a nM
Citation Sabb, ALVogel, RLWelmaker, GSSabalski, JECoupet, JDunlop, JRosenzweig-Lipson, SHarrison, B Cycloalkyl[b][1,4]benzodiazepinoindoles are agonists at the human 5-HT2C receptor. Bioorg Med Chem Lett14:2603-7 (2004) 
 
5-hydroxytryptamine receptor 2C
Name:5-hydroxytryptamine receptor 2C
Type:G Protein-Coupled Receptor (GPCR)
Mol. Mass.:51836.79
Organism:Homo sapiens (Human)
Description:P28335
Residue:458
BDBM50145569
NameBDBM50145569
Synonyms:7-Fluoro-1,2,3,4,8,9,10,11-octahydro-[1,4]diazepino[6,7,1-jk]carbazole | CHEMBL88248
TypeSmall organic molecule
Emp. Form.C15H17FN2
Mol. Mass.244.3073
SMILESFc1ccc2CNCCn3c4CCCCc4c1c23