Reaction Details
Target5-hydroxytryptamine receptor 2C
LigandBDBM50145568
Substrate/Competitorn/a
Meas. Tech.ChEBML_2960
Ki 97±n/a nM
Citation Sabb, ALVogel, RLWelmaker, GSSabalski, JECoupet, JDunlop, JRosenzweig-Lipson, SHarrison, B Cycloalkyl[b][1,4]benzodiazepinoindoles are agonists at the human 5-HT2C receptor. Bioorg Med Chem Lett14:2603-7 (2004) 
 
5-hydroxytryptamine receptor 2C
Name:5-hydroxytryptamine receptor 2C
Type:G Protein-Coupled Receptor (GPCR)
Mol. Mass.:51836.79
Organism:Homo sapiens (Human)
Description:P28335
Residue:458
BDBM50145568
NameBDBM50145568
Synonyms:4,5,6,7,9,10-Hexahydro-8H-5,7a-diaza-benzo[cd]cyclopenta[a]azulene | CHEMBL315480
TypeSmall organic molecule
Emp. Form.C14H16N2
Mol. Mass.212.2902
SMILESC1Cc2c(C1)c1cccc3CNCCn2c13