Reaction Details
TargetGenome polyprotein
LigandBDBM50145832
Substrate/Competitorn/a
Meas. Tech.ChEMBL_143475 (CHEMBL751815)
Kd>20000±n/a nM
Citation Wyss, DFArasappan, ASenior, MMWang, YSBeyer, BMNjoroge, FGMcCoy, MA Non-peptidic small-molecule inhibitors of the single-chain hepatitis C virus NS3 protease/NS4A cofactor complex discovered by structure-based NMR screening. J Med Chem47:2486-98 (2004) 
 
Genome polyprotein
Name:Genome polyprotein
Type:Protein
Mol. Mass.:67067.41
Organism:Hepatitis C virus
Description:A3EZI9
Residue:631
BDBM50145832
NameBDBM50145832
Synonyms:CHEMBL82673 | Cyclopropyl-(4-methoxy-phenyl)-methanone
TypeSmall organic molecule
Emp. Form.C11H12O2
Mol. Mass.176.2118
SMILESCOc1ccc(cc1)C(=O)C1CC1