Reaction Details
TargetGenome polyprotein
LigandBDBM50145835
Substrate/Competitorn/a
Meas. Tech.ChEMBL_143477 (CHEMBL751817)
Ki 600000±n/a nM
Citation Wyss, DFArasappan, ASenior, MMWang, YSBeyer, BMNjoroge, FGMcCoy, MA Non-peptidic small-molecule inhibitors of the single-chain hepatitis C virus NS3 protease/NS4A cofactor complex discovered by structure-based NMR screening. J Med Chem47:2486-98 (2004) 
 
Genome polyprotein
Name:Genome polyprotein
Type:Protein
Mol. Mass.:67067.41
Organism:Hepatitis C virus
Description:A3EZI9
Residue:631
BDBM50145835
NameBDBM50145835
Synonyms:4-Hydroxy-3,5-diiodo-benzoic acid | CHEMBL83650
TypeSmall organic molecule
Emp. Form.C7H4I2O3
Mol. Mass.389.9138
SMILESOC(=O)c1cc(I)c(O)c(I)c1