Reaction Details
TargetGenome polyprotein
LigandBDBM50145843
Substrate/Competitorn/a
Meas. Tech.ChEMBL_143475 (CHEMBL751815)
Kd>20000±n/a nM
Citation Wyss, DFArasappan, ASenior, MMWang, YSBeyer, BMNjoroge, FGMcCoy, MA Non-peptidic small-molecule inhibitors of the single-chain hepatitis C virus NS3 protease/NS4A cofactor complex discovered by structure-based NMR screening. J Med Chem47:2486-98 (2004) 
 
Genome polyprotein
Name:Genome polyprotein
Type:Protein
Mol. Mass.:67067.41
Organism:Hepatitis C virus
Description:A3EZI9
Residue:631
BDBM50145843
NameBDBM50145843
Synonyms:4-Amino-N-(2-amino-4-methyl-phenyl)-benzamide | CHEMBL84049
TypeSmall organic molecule
Emp. Form.C14H15N3O
Mol. Mass.241.2884
SMILESCc1ccc(NC(=O)c2ccc(N)cc2)c(N)c1