Reaction Details
TargetEstrogen receptor
LigandBDBM50146198
Substrate/Competitorn/a
Meas. Tech.ChEBML_67500
IC50 20±n/a nM
Citation Chesworth, RZawistoski, MPLefker, BACameron, KODay, RFMangano, FMRosati, RLColella, SPetersen, DNBrault, ALu, BPan, LCPerry, PNg, OCastleberry, TAOwen, TABrown, TAThompson, DDDaSilva-Jardine, P Tetrahydroisoquinolines as subtype selective estrogen agonists/antagonists. Bioorg Med Chem Lett14:2729-33 (2004) 
 
Estrogen receptor
Name:Estrogen receptor
Type:Protein
Mol. Mass.:66230.44
Organism:Homo sapiens (Human)
Description:P03372
Residue:595
BDBM50146198
NameBDBM50146198
Synonyms:2-Benzyl-4-(4-hydroxy-phenyl)-1,2,3,4-tetrahydro-isoquinolin-7-ol | CHEMBL93826
TypeSmall organic molecule
Emp. Form.C22H21NO2
Mol. Mass.331.4076
SMILESOc1ccc(cc1)C1CN(Cc2ccccc2)Cc2cc(O)ccc12