Reaction Details
TargetEstrogen receptor beta
LigandBDBM50146202
Substrate/Competitorn/a
Meas. Tech.ChEBML_67820
IC50 93±n/a nM
Citation Chesworth, RZawistoski, MPLefker, BACameron, KODay, RFMangano, FMRosati, RLColella, SPetersen, DNBrault, ALu, BPan, LCPerry, PNg, OCastleberry, TAOwen, TABrown, TAThompson, DDDaSilva-Jardine, P Tetrahydroisoquinolines as subtype selective estrogen agonists/antagonists. Bioorg Med Chem Lett14:2729-33 (2004) 
 
Estrogen receptor beta
Name:Estrogen receptor beta
Type:Protein
Mol. Mass.:59238.43
Organism:Homo sapiens (Human)
Description:Q92731
Residue:530
BDBM50146202
NameBDBM50146202
Synonyms:2,2,2-Trifluoro-1-{6-hydroxy-1-[4-(2-pyrrolidin-1-yl-ethoxy)-phenyl]-3,4-dihydro-1H-isoquinolin-2-yl}-ethanone | CHEMBL89994
TypeSmall organic molecule
Emp. Form.C23H25F3N2O3
Mol. Mass.434.4514
SMILESOc1ccc2C(N(CCc2c1)C(=O)C(F)(F)F)c1ccc(OCCN2CCCC2)cc1