Reaction Details
TargetEstrogen receptor
LigandBDBM50146206
Substrate/Competitorn/a
Meas. Tech.ChEBML_67500
IC50 4.7±n/a nM
Citation Chesworth, RZawistoski, MPLefker, BACameron, KODay, RFMangano, FMRosati, RLColella, SPetersen, DNBrault, ALu, BPan, LCPerry, PNg, OCastleberry, TAOwen, TABrown, TAThompson, DDDaSilva-Jardine, P Tetrahydroisoquinolines as subtype selective estrogen agonists/antagonists. Bioorg Med Chem Lett14:2729-33 (2004) 
 
Estrogen receptor
Name:Estrogen receptor
Type:Protein
Mol. Mass.:66230.44
Organism:Homo sapiens (Human)
Description:P03372
Residue:595
BDBM50146206
NameBDBM50146206
Synonyms:2-Benzyl-1-[4-(2-pyrrolidin-1-yl-ethoxy)-phenyl]-1,2,3,4-tetrahydro-isoquinolin-6-ol | CHEMBL94280
TypeSmall organic molecule
Emp. Form.C28H32N2O2
Mol. Mass.428.5659
SMILESOc1ccc2C(N(Cc3ccccc3)CCc2c1)c1ccc(OCCN2CCCC2)cc1