Reaction Details
TargetEstrogen receptor
LigandBDBM20585
Substrate/Competitorn/a
Meas. Tech.ChEBML_67500
IC50 12±n/a nM
Citation Chesworth, RZawistoski, MPLefker, BACameron, KODay, RFMangano, FMRosati, RLColella, SPetersen, DNBrault, ALu, BPan, LCPerry, PNg, OCastleberry, TAOwen, TABrown, TAThompson, DDDaSilva-Jardine, P Tetrahydroisoquinolines as subtype selective estrogen agonists/antagonists. Bioorg Med Chem Lett14:2729-33 (2004) 
 
Estrogen receptor
Name:Estrogen receptor
Type:Protein
Mol. Mass.:66230.44
Organism:Homo sapiens (Human)
Description:P03372
Residue:595
BDBM20585
NameBDBM20585
Synonyms:2-phenyl-1-{4-[2-(pyrrolidin-1-yl)ethoxy]phenyl}-1,2,3,4-tetrahydroisoquinolin-6-ol tetrahydroisoquinoline derivative, 17a
TypeSmall organic molecule
Emp. Form.C27H30N2O2
Mol. Mass.414.5393
SMILESOc1ccc2C(N(CCc2c1)c1ccccc1)c1ccc(OCCN2CCCC2)cc1