Reaction Details
TargetEstrogen receptor
LigandBDBM50146223
Substrate/Competitorn/a
Meas. Tech.ChEBML_67500
IC50 5.2±n/a nM
Citation Chesworth, RZawistoski, MPLefker, BACameron, KODay, RFMangano, FMRosati, RLColella, SPetersen, DNBrault, ALu, BPan, LCPerry, PNg, OCastleberry, TAOwen, TABrown, TAThompson, DDDaSilva-Jardine, P Tetrahydroisoquinolines as subtype selective estrogen agonists/antagonists. Bioorg Med Chem Lett14:2729-33 (2004) 
 
Estrogen receptor
Name:Estrogen receptor
Type:Protein
Mol. Mass.:66230.44
Organism:Homo sapiens (Human)
Description:P03372
Residue:595
BDBM50146223
NameBDBM50146223
Synonyms:2-Benzenesulfonyl-1-[4-(2-pyrrolidin-1-yl-ethoxy)-phenyl]-1,2,3,4-tetrahydro-isoquinolin-6-ol | CHEMBL420244
TypeSmall organic molecule
Emp. Form.C27H30N2O4S
Mol. Mass.478.603
SMILESOc1ccc2C(N(CCc2c1)S(=O)(=O)c1ccccc1)c1ccc(OCCN2CCCC2)cc1