Reaction Details
TargetEstrogen receptor
LigandBDBM50146278
Substrate/Competitorn/a
Meas. Tech.ChEMBL_67363 (CHEMBL873603)
IC50 5.3±n/a nM
Citation Kim, SWu, JChen, HYBirzin, ETChan, WYang, YTColwell, LLi, SDahllund, JDiNinno, FRohrer, SPSchaeffer, JMHammond, ML Estrogen receptor ligands. Part 4: The SAR of the syn-dihydrobenzoxathiin SERAMs. Bioorg Med Chem Lett14:2741-5 (2004) 
 
Estrogen receptor
Name:Estrogen receptor
Type:Protein
Mol. Mass.:66230.44
Organism:Homo sapiens (Human)
Description:P03372
Residue:595
BDBM50146278
NameBDBM50146278
Synonyms:(2R,3S)-3-(4-Hydroxy-phenyl)-8-methyl-2-[4-(2-piperidin-1-yl-ethoxy)-phenyl]-2,3-dihydro-benzo[1,4]oxathiin-6-ol | CHEMBL327471
TypeSmall organic molecule
Emp. Form.C28H31NO4S
Mol. Mass.477.615
SMILESCc1cc(O)cc2S[C@H]([C@H](Oc12)c1ccc(OCCN2CCCCC2)cc1)c1ccc(O)cc1