Reaction Details
TargetEstrogen receptor
LigandBDBM50146265
Substrate/Competitorn/a
Meas. Tech.ChEMBL_67495 (CHEMBL679886)
IC50 94±n/a nM
Citation Kim, SWu, JChen, HYBirzin, ETChan, WYang, YTColwell, LLi, SDahllund, JDiNinno, FRohrer, SPSchaeffer, JMHammond, ML Estrogen receptor ligands. Part 4: The SAR of the syn-dihydrobenzoxathiin SERAMs. Bioorg Med Chem Lett14:2741-5 (2004) 
 
Estrogen receptor
Name:Estrogen receptor
Type:Protein
Mol. Mass.:66230.44
Organism:Homo sapiens (Human)
Description:P03372
Residue:595
BDBM50146265
NameBDBM50146265
Synonyms:3-(4-Fluoro-phenyl)-2-[4-(2-piperidin-1-yl-ethoxy)-phenyl]-2,3-dihydro-benzo[1,4]oxathiin-6-ol | CHEMBL93546
TypeSmall organic molecule
Emp. Form.C27H28FNO3S
Mol. Mass.465.58
SMILESOc1ccc2OC(C(Sc2c1)c1ccc(F)cc1)c1ccc(OCCN2CCCCC2)cc1