Reaction Details
TargetEstrogen receptor
LigandBDBM50144847
Substrate/Competitorn/a
Meas. Tech.ChEMBL_67363 (CHEMBL873603)
IC50 1.8±n/a nM
Citation Kim, SWu, JChen, HYBirzin, ETChan, WYang, YTColwell, LLi, SDahllund, JDiNinno, FRohrer, SPSchaeffer, JMHammond, ML Estrogen receptor ligands. Part 4: The SAR of the syn-dihydrobenzoxathiin SERAMs. Bioorg Med Chem Lett14:2741-5 (2004) 
 
Estrogen receptor
Name:Estrogen receptor
Type:Protein
Mol. Mass.:66230.44
Organism:Homo sapiens (Human)
Description:P03372
Residue:595
BDBM50144847
NameBDBM50144847
Synonyms:(2R,3S)-3-(4-Hydroxy-phenyl)-2-[4-(2-piperidin-1-yl-ethoxy)-phenyl]-2,3-dihydro-benzo[1,4]oxathiin-7-ol | CHEMBL71584
TypeSmall organic molecule
Emp. Form.C27H29NO4S
Mol. Mass.463.588
SMILESOc1ccc(cc1)[C@@H]1Sc2ccc(O)cc2O[C@@H]1c1ccc(OCCN2CCCCC2)cc1