Reaction Details
TargetEstrogen receptor
LigandBDBM50146271
Substrate/Competitorn/a
Meas. Tech.ChEMBL_67495 (CHEMBL679886)
IC50 3.5±n/a nM
Citation Kim, SWu, JChen, HYBirzin, ETChan, WYang, YTColwell, LLi, SDahllund, JDiNinno, FRohrer, SPSchaeffer, JMHammond, ML Estrogen receptor ligands. Part 4: The SAR of the syn-dihydrobenzoxathiin SERAMs. Bioorg Med Chem Lett14:2741-5 (2004) 
 
Estrogen receptor
Name:Estrogen receptor
Type:Protein
Mol. Mass.:66230.44
Organism:Homo sapiens (Human)
Description:P03372
Residue:595
BDBM50146271
NameBDBM50146271
Synonyms:(2S,3R)-2-[4-(2-Cycloheptylamino-ethoxy)-phenyl]-3-(3-hydroxy-phenyl)-2,3-dihydro-benzo[1,4]oxathiin-6-ol | CHEMBL94225
TypeSmall organic molecule
Emp. Form.C29H33NO4S
Mol. Mass.491.642
SMILESOc1cccc(c1)[C@H]1Sc2cc(O)ccc2O[C@H]1c1ccc(OCCNC2CCCCCC2)cc1