Reaction Details
TargetComplement C1s subcomponent
LigandBDBM50147046
Substrate/Competitorn/a
Meas. Tech.ChEMBL_48032 (CHEMBL885071)
IC50 300±n/a nM
Citation Subasinghe, NLAli, FIllig, CRJonathan Rudolph, MKlein, SKhalil, ESoll, RMBone, RFSpurlino, JCDesJarlais, RLCrysler, CSCummings, MDMorris, PEKilpatrick, JMSudhakara Babu, Y A novel series of potent and selective small molecule inhibitors of the complement component C1s. Bioorg Med Chem Lett14:3043-7 (2004) 
 
Complement C1s subcomponent
Name:Complement C1s subcomponent
Type:Protein
Mol. Mass.:76657.91
Organism:Homo sapiens (Human)
Description:P09871
Residue:688
BDBM50147046
NameBDBM50147046
Synonyms:5-Methylsulfanyl-4-[4-(5-propoxy-1-pyridin-2-yl-1H-pyrazol-4-yl)-thiazol-2-yl]-thiophene-2-carboxamidine | CHEMBL317917
TypeSmall organic molecule
Emp. Form.C20H20N6OS3
Mol. Mass.456.607
SMILESCCCOc1c(cnn1-c1ccccn1)-c1csc(n1)-c1cc(sc1SC)C(N)=N