Reaction Details
TargetCyclin-A1/Cyclin-A2/Cyclin-dependent kinase 2
LigandBDBM50147463
Substrate/Competitorn/a
Meas. Tech.ChEMBL_50679 (CHEMBL663350)
IC50 2800±n/a nM
Citation Zhang, HCYe, HConway, BRDerian, CKAddo, MFKuo, GHHecker, LRCroll, DRLi, JWestover, LXu, JZLook, RDemarest, KTAndrade-Gordon, PDamiano, BPMaryanoff, BE 3-(7-Azaindolyl)-4-arylmaleimides as potent, selective inhibitors of glycogen synthase kinase-3. Bioorg Med Chem Lett14:3245-50 (2004) 
 
Cyclin-A1/Cyclin-A2/Cyclin-dependent kinase 2
Name:Cyclin-A1/Cyclin-A2/Cyclin-dependent kinase 2
Type:n/a
Mol. Mass.:n/a
Description:ASSAY_ID of EBI is 42813
Components:This complex has 3 components.
Component 1
Name:Cyclin-A2
Synonyms:CCN1 CCNA1 CCNA2_HUMAN Cyclin-A
Type:Enzyme Subunit
Mol. Mass.:48550.19
Organism:Homo sapiens (Human)
Description:P20248
Residue:432
Component 2
Name:Cyclin-A1
Synonyms:CCNA1 CDK2/Cyclin A1 Cyclin-A1/Cyclin-dependent kinase 4
Type:Enzyme
Mol. Mass.:52343.37
Organism:Homo sapiens (Human)
Description:P78396
Residue:465
Component 3
Name:Cyclin-dependent kinase 2
Synonyms:CDK2 CDK2_HUMAN Cell division protein kinase 2 Protein cereblon/Cyclin-dependent kinase 2 | p33 protein kinase
Type:Enzyme Subunit
Mol. Mass.:33938.17
Organism:Homo sapiens (Human)
Description:P24941
Residue:298
Component 4
Name:Cyclin-A2
Synonyms:CCN1 CCNA1 CCNA2_HUMAN Cyclin-A
Type:Enzyme Subunit
Mol. Mass.:48550.19
Organism:Homo sapiens (Human)
Description:P20248
Residue:432
BDBM50147463
NameBDBM50147463
Synonyms:3-(3-Chloro-5-trifluoromethyl-pyridin-2-yl)-4-[1-(3-hydroxy-propyl)-1H-pyrrolo[2,3-b]pyridin-3-yl]-pyrrole-2,5-dione | CHEMBL111620
TypeSmall organic molecule
Emp. Form.C20H14ClF3N4O3
Mol. Mass.450.798
SMILESOCCCn1cc(C2=C(C(=O)NC2=O)c2ncc(cc2Cl)C(F)(F)F)c2cccnc12