Reaction Details
TargetRibosomal protein S6 kinase alpha-5
LigandBDBM50147463
Substrate/Competitorn/a
Meas. Tech.ChEBML_103931
IC50>10000±n/a nM
Citation Zhang, HCYe, HConway, BRDerian, CKAddo, MFKuo, GHHecker, LRCroll, DRLi, JWestover, LXu, JZLook, RDemarest, KTAndrade-Gordon, PDamiano, BPMaryanoff, BE 3-(7-Azaindolyl)-4-arylmaleimides as potent, selective inhibitors of glycogen synthase kinase-3. Bioorg Med Chem Lett14:3245-50 (2004) 
 
Ribosomal protein S6 kinase alpha-5
Name:Ribosomal protein S6 kinase alpha-5
Type:Serine/threonine-protein kinase
Mol. Mass.:89874.44
Organism:Homo sapiens (Human)
Description:n/a
Residue:802
BDBM50147463
NameBDBM50147463
Synonyms:3-(3-Chloro-5-trifluoromethyl-pyridin-2-yl)-4-[1-(3-hydroxy-propyl)-1H-pyrrolo[2,3-b]pyridin-3-yl]-pyrrole-2,5-dione | CHEMBL111620
TypeSmall organic molecule
Emp. Form.C20H14ClF3N4O3
Mol. Mass.450.798
SMILESOCCCn1cc(C2=C(C(=O)NC2=O)c2ncc(cc2Cl)C(F)(F)F)c2cccnc12