Reaction Details
TargetProtein kinase C beta type
LigandBDBM50147465
Substrate/Competitorn/a
Meas. Tech.ChEBML_152990
IC50 2380±n/a nM
Citation Zhang, HCYe, HConway, BRDerian, CKAddo, MFKuo, GHHecker, LRCroll, DRLi, JWestover, LXu, JZLook, RDemarest, KTAndrade-Gordon, PDamiano, BPMaryanoff, BE 3-(7-Azaindolyl)-4-arylmaleimides as potent, selective inhibitors of glycogen synthase kinase-3. Bioorg Med Chem Lett14:3245-50 (2004) 
 
Protein kinase C beta type
Name:Protein kinase C beta type
Type:Enzyme
Mol. Mass.:76873.67
Organism:Homo sapiens (Human)
Description:The recombinant human PKC enzymes were produced using a baculovirus expression system in SF9 cells
Residue:671
BDBM50147465
NameBDBM50147465
Synonyms:3-(2-Chloro-4-fluoro-phenyl)-4-[1-(3-hydroxy-propyl)-1H-pyrrolo[2,3-b]pyridin-3-yl]-pyrrole-2,5-dione | CHEMBL111005
TypeSmall organic molecule
Emp. Form.C20H15ClFN3O3
Mol. Mass.399.803
SMILESOCCCn1cc(C2=C(C(=O)NC2=O)c2ccc(F)cc2Cl)c2cccnc12